Sie sind nicht angemeldet.

Lieber Besucher, herzlich willkommen bei: Ubuntu-Forum & Kubuntu-Forum | www.Ubuntu-Forum.de. Falls dies Ihr erster Besuch auf dieser Seite ist, lesen Sie sich bitte die Hilfe durch. Dort wird Ihnen die Bedienung dieser Seite näher erläutert. Darüber hinaus sollten Sie sich registrieren, um alle Funktionen dieser Seite nutzen zu können. Benutzen Sie das Registrierungsformular, um sich zu registrieren oder informieren Sie sich ausführlich über den Registrierungsvorgang. Falls Sie sich bereits zu einem früheren Zeitpunkt registriert haben, können Sie sich hier anmelden.

  • »EterObl« ist der Autor dieses Themas

Beiträge: 13

Registrierungsdatum: 27.09.2015

Derivat: Ubuntu

Architektur: 64-Bit PC

Desktop: Unity

  • Nachricht senden

1

30.10.2016, 11:03

WLAN Stick TL-WN823N(EU) Ver:2.0

Guten Tag!

ich habe mir einen neuen WLAN- Stick (TL-WN823N(EU) Ver:2.0) gekauft, da ich gelesen habe, dass es möglich ist, diesen mit LINUX zu verwenden. Leider war es mir nicht möglich, den auf der TP-Link Website angebotenen Treiber zu installieren.
Ich verwende Ubuntu 14.04. LTS mit folgendem Kernel:

Quellcode

1
Linux TMM 4.4.0-45-generic #66~14.04.1-Ubuntu SMP Wed Oct 19 15:05:38 UTC 2016 x86_64 x86_64 x86_64 GNU/Linux


Nachdem ich versuche den Treiber mit sudo make zu kompilieren, bekomme ich folgende Fehlermeldungen:

Quellcode

1
2
3
4
5
6
7
8
9
10
11
12
13
14
15
16
17
18
19
20
21
22
23
24
25
26
27
28
29
30
31
32
33
34
35
36
37
38
39
40
41
42
43
44
45
46
47
48
49
50
51
52
53
54
55
56
57
58
59
60
61
62
63
64
65
66
67
68
69
70
71
72
73
74
75
76
"******************************************"
"NO SKRC,we will use default KSRC"
"******************************************"
make ARCH=x86_64 CROSS_COMPILE= -C /lib/modules/4.4.0-45-generic/build M=/home/tiz/Downloads/1/Driver  modules
make[1]: Verzeichnis »/usr/src/linux-headers-4.4.0-45-generic« wird betreten
"******************************************"
"NO SKRC,we will use default KSRC"
"******************************************"
  CC [M]  /home/tiz/Downloads/1/Driver/core/rtw_cmd.o
In file included from /home/tiz/Downloads/1/Driver/include/drv_types.h:95:0,
             	from /home/tiz/Downloads/1/Driver/core/rtw_cmd.c:22:
/home/tiz/Downloads/1/Driver/include/hal_com.h:413:13: error: ‘file_path’ redeclared as different kind of symbol
 extern char file_path[PATH_LENGTH_MAX];
         	^
In file included from include/linux/compat.h:15:0,
             	from include/linux/ethtool.h:15,
             	from include/linux/netdevice.h:42,
             	from /home/tiz/Downloads/1/Driver/include/osdep_service_linux.h:35,
             	from /home/tiz/Downloads/1/Driver/include/osdep_service.h:41,
             	from /home/tiz/Downloads/1/Driver/include/drv_types.h:32,
             	from /home/tiz/Downloads/1/Driver/core/rtw_cmd.c:22:
include/linux/fs.h:2597:14: note: previous declaration of ‘file_path’ was here
 extern char *file_path(struct file *, char *, int);
          	^
In file included from /home/tiz/Downloads/1/Driver/include/drv_types.h:65:0,
             	from /home/tiz/Downloads/1/Driver/core/rtw_cmd.c:22:
/home/tiz/Downloads/1/Driver/core/rtw_cmd.c: In function ‘btinfo_evt_dump’:
/home/tiz/Downloads/1/Driver/include/rtw_debug.h:187:19: error: void value not ignored as it ought to be
  #define _seqdump seq_printf
               	^
/home/tiz/Downloads/1/Driver/include/rtw_debug.h:242:7: note: in expansion of macro ‘_seqdump’
	if(_seqdump(sel, fmt, ##arg)) /*rtw_warn_on(1)*/; \
   	^
/home/tiz/Downloads/1/Driver/core/rtw_cmd.c:3293:2: note: in expansion of macro ‘DBG_871X_SEL_NL’
  DBG_871X_SEL_NL(sel, "cid:0x%02x, len:%u\n", info->cid, info->len);
  ^
/home/tiz/Downloads/1/Driver/include/rtw_debug.h:187:19: error: void value not ignored as it ought to be
  #define _seqdump seq_printf
               	^
/home/tiz/Downloads/1/Driver/include/rtw_debug.h:242:7: note: in expansion of macro ‘_seqdump’
	if(_seqdump(sel, fmt, ##arg)) /*rtw_warn_on(1)*/; \
   	^
/home/tiz/Downloads/1/Driver/core/rtw_cmd.c:3296:3: note: in expansion of macro ‘DBG_871X_SEL_NL’
   DBG_871X_SEL_NL(sel, "byte2:%s%s%s%s%s%s%s%s\n"
   ^
/home/tiz/Downloads/1/Driver/include/rtw_debug.h:187:19: error: void value not ignored as it ought to be
  #define _seqdump seq_printf
               	^
/home/tiz/Downloads/1/Driver/include/rtw_debug.h:242:7: note: in expansion of macro ‘_seqdump’
	if(_seqdump(sel, fmt, ##arg)) /*rtw_warn_on(1)*/; \
   	^
/home/tiz/Downloads/1/Driver/core/rtw_cmd.c:3308:3: note: in expansion of macro ‘DBG_871X_SEL_NL’
   DBG_871X_SEL_NL(sel, "retry_cnt:%u\n", info->retry_cnt);
   ^
/home/tiz/Downloads/1/Driver/include/rtw_debug.h:187:19: error: void value not ignored as it ought to be
  #define _seqdump seq_printf
               	^
/home/tiz/Downloads/1/Driver/include/rtw_debug.h:242:7: note: in expansion of macro ‘_seqdump’
	if(_seqdump(sel, fmt, ##arg)) /*rtw_warn_on(1)*/; \
   	^
/home/tiz/Downloads/1/Driver/core/rtw_cmd.c:3311:3: note: in expansion of macro ‘DBG_871X_SEL_NL’
   DBG_871X_SEL_NL(sel, "rssi:%u\n", info->rssi);
   ^
/home/tiz/Downloads/1/Driver/include/rtw_debug.h:187:19: error: void value not ignored as it ought to be
  #define _seqdump seq_printf
               	^
/home/tiz/Downloads/1/Driver/include/rtw_debug.h:242:7: note: in expansion of macro ‘_seqdump’
	if(_seqdump(sel, fmt, ##arg)) /*rtw_warn_on(1)*/; \
   	^
/home/tiz/Downloads/1/Driver/core/rtw_cmd.c:3314:3: note: in expansion of macro ‘DBG_871X_SEL_NL’
   DBG_871X_SEL_NL(sel, "byte5:%s%s\n"
   ^
make[2]: *** [/home/tiz/Downloads/1/Driver/core/rtw_cmd.o] Fehler 1
make[1]: *** [_module_/home/tiz/Downloads/1/Driver] Fehler 2
make[1]: Verzeichnis »/usr/src/linux-headers-4.4.0-45-generic« wird verlassen
make: *** [modules] Fehler 2


Ich weiß nun überhaupt nicht, was ich machen kann, um das Problem zu beheben, bin sehr unerfahren.
Ich wäre euch sehr dankbar, wenn ihr mir vielleicht weiterhelfen könntet!

Mit freundlichen Grüßen,
Eter

Dieser Beitrag wurde bereits 1 mal editiert, zuletzt von »EterObl« (01.11.2016, 13:38)


  • »EterObl« ist der Autor dieses Themas

Beiträge: 13

Registrierungsdatum: 27.09.2015

Derivat: Ubuntu

Architektur: 64-Bit PC

Desktop: Unity

  • Nachricht senden

2

01.11.2016, 13:37

Hallo,

ich habe das Problem gelöst. Für alle, die das selbe Problem haben:

ich habe folgenden, aktuellen Treiber installiert:

https://github.com/Mange/rtl8192eu-linux-driver

Jetzt funktioniert es wunderbar!

Viele Grüße!
Eter