Sie sind nicht angemeldet.

emir

User

  • »emir« ist der Autor dieses Themas

Beiträge: 16

Registrierungsdatum: 20.11.2006

  • Nachricht senden

1

20.11.2006, 09:10

[gelöst] KDevelop kompiliert nicht

Hallo !!

Ich benutze seit einigen Tagen Kubuntu 6.10(auch zum ersten Mal Linux).

Hauptgrund ist: KDevelop da ich es auch auf der Uni verwenden muss
Beim kompilieren tritt immer folgende Fehlermeldung auf:

cd '/home/emir/test' && WANT_AUTOCONF_2_5="1" WANT_AUTOMAKE_1_6="1" make -f Makefile.cvs && mkdir '/home/emir/test/debug' && cd '/home/emir/test/debug' && CFLAGS="-O0 -g3 " "/home/emir/test/configure" --enable-debug=full && cd '/home/emir/test/debug' && WANT_AUTOCONF_2_5="1" WANT_AUTOMAKE_1_6="1" make
aclocal
make: aclocal: Kommando nicht gefunden
make: *** [all] Fehler 127
*** Exited with status: 2 ***

Ich hoffe ihr könnt mir weiterhelfen

gruß Emir

Dieser Beitrag wurde bereits 1 mal editiert, zuletzt von »emir« (02.12.2006, 10:19)


  • »maettu« ist männlich

Beiträge: 3 299

Registrierungsdatum: 14.09.2005

Derivat: Xubuntu

Architektur: 64-Bit PC

Desktop: XFCE

  • Nachricht senden

2

20.11.2006, 09:29

Hallo kdevelop musst du nicht unbedingt selbst kompillieren, den in Universe befindet sich schon ein Packet davon...
Also einfach universe in deine Packetquellen aufnehmen, am besten schaust du mal hier

Gruess
Maettu

PS: Meine Grundregel beim installieren von Software:
1. Schauen ob es schon ein Ubuntu-Packet gibt, wenn ja und version funktioniert glücklich sein ;)
2. Selber kompillieren, nach 3 Satz:
a)./configure
b)./make
c)./make install (oder bessser checkinstall verwenden, da mit checkinstall ein Debianpacket erstellt wird, welches sich sicher wieder deinstallieren lässt)

  • »odenter« ist männlich

Beiträge: 21

Registrierungsdatum: 18.11.2006

  • Nachricht senden

3

20.11.2006, 14:35

Sein Problem, im übrigen auch meins, ist nicht das KDevelop nicht übersetzt wird. Sondern das man mit KDevelop nichts übersetzen kann!

  • »Sknulp« ist männlich

Beiträge: 715

Registrierungsdatum: 11.03.2006

  • Nachricht senden

4

20.11.2006, 15:36

Hast du im Menü "Erstellen" die Option "Configure ausführen" angeklickt, bevor Du kompilieren wolltest?
Software is like sex: it's better when it's free. (Linus Torvalds)

emir

User

  • »emir« ist der Autor dieses Themas

Beiträge: 16

Registrierungsdatum: 20.11.2006

  • Nachricht senden

5

20.11.2006, 18:52

ich mach genau das selbe wie an der uni. werds mir aber jetzt mal genauer anschaun.

@maettu: das programm hab ich mit "anwendung hinzufügen/entfernen" installiert
über die kosole geht bei mir immer was schief

kann das ganze was damit zu tun haben dass man nicht über root-rechte verfügt und KDev deswegen auf bestimmte sachen nicht zugreifen kann??

Dieser Beitrag wurde bereits 1 mal editiert, zuletzt von »emir« (20.11.2006, 19:09)


emir

User

  • »emir« ist der Autor dieses Themas

Beiträge: 16

Registrierungsdatum: 20.11.2006

  • Nachricht senden

6

20.11.2006, 19:13

@Sknulp: hab jetzt ausprobiert("run configure") und es kommt folgendes

cd '/home/emir/a/debug' && CFLAGS="-O0 -g3 " "/home/emir/a/configure" --enable-debug=full
/bin/sh: /home/emir/a/configure: not found
*** Exited with status: 127 ***

außerdem fragt er sowieso immer ob er configure ausführen soll.

  • »odenter« ist männlich

Beiträge: 21

Registrierungsdatum: 18.11.2006

  • Nachricht senden

7

20.11.2006, 20:07

Ich bekomme die gleiche Fehlermeldung.

emir

User

  • »emir« ist der Autor dieses Themas

Beiträge: 16

Registrierungsdatum: 20.11.2006

  • Nachricht senden

8

20.11.2006, 20:18

und nun hoffen wir beide auf die gute alte linux-gemeinde :)

ob sie ihrem ruf gerecht wird?? *g*

  • »Sknulp« ist männlich

Beiträge: 715

Registrierungsdatum: 11.03.2006

  • Nachricht senden

9

21.11.2006, 12:04

Zitat

ob sie ihrem ruf gerecht wird?? *g*


Jetzt willst Du wohl jemanden herausfordern. ;)

Zitat

sudo ln -sf /bin/bash /bin/sh


Die Erklärung folgt, wenn's funktioniert :]
Software is like sex: it's better when it's free. (Linus Torvalds)

emir

User

  • »emir« ist der Autor dieses Themas

Beiträge: 16

Registrierungsdatum: 20.11.2006

  • Nachricht senden

10

21.11.2006, 18:01

naja scheinbar muss dich/euch herausfordern damit ihr loslegt: :P

hab "sudo ln -sf /bin/bash /bin/sh" in der konsole eingegeben und danach das root-passwort.

krieg noch immer die selbe fehlermeldung. oder muss ich die zeile inrgendwo anders eingeben?

Dieser Beitrag wurde bereits 1 mal editiert, zuletzt von »emir« (21.11.2006, 18:02)


  • »odenter« ist männlich

Beiträge: 21

Registrierungsdatum: 18.11.2006

  • Nachricht senden

11

21.11.2006, 22:10

Problem bleibt bei mir auch das gleiche.
Aber bei mir ware make nicht installiert...
Nachdem ich es installiert habe bekomme ich nun folgende Fehlermeldung

Quellcode

1
2
3
4
5
cd '/home/odenter/dev/c_test' && WANT_AUTOCONF_2_5="1" WANT_AUTOMAKE_1_6="1" make -f Makefile.cvs && cd '/home/odenter/dev/c_test/debug' && CFLAGS="-O0 -g3 " "/home/odenter/dev/c_test/configure" --enable-debug=full && cd '/home/odenter/dev/c_test/debug' && WANT_AUTOCONF_2_5="1" WANT_AUTOMAKE_1_6="1" make -k 
aclocal
aclocal: configure.in: 8: macro `AM_PROG_LIBTOOL' not found in library
make: *** [all] Fehler 1
*** Exited with status: 2 ***

  • »Sknulp« ist männlich

Beiträge: 715

Registrierungsdatum: 11.03.2006

  • Nachricht senden

12

21.11.2006, 23:14

@odenter: Hast Du das Paket libtool installiert? Wenn nicht:

Zitat

sudo apt-get install libtool


@emir: Ist Deine Fehlermeldung völlig identisch? Wenn nicht, einmal posten, bitte.
Software is like sex: it's better when it's free. (Linus Torvalds)

  • »odenter« ist männlich

Beiträge: 21

Registrierungsdatum: 18.11.2006

  • Nachricht senden

13

22.11.2006, 18:05

Libtool war nicht installiert genauso wie gdb.
Nun scheint alles zu funktionieren.

  • »odenter« ist männlich

Beiträge: 21

Registrierungsdatum: 18.11.2006

  • Nachricht senden

14

22.11.2006, 20:23

Ein weiteres Problem hat sich aufgetan. :(

Also c Programme lassen sich übersetzen, allerdings keine c++ Programme.
Es kommt folgende Meldung/Fehlermeldung:

Quellcode

1
2
3
4
5
6
7
8
9
10
11
12
13
14
15
16
17
18
19
20
21
22
23
24
25
26
27
28
29
30
cd '/home/odenter/dev/framework' && WANT_AUTOCONF_2_5="1" WANT_AUTOMAKE_1_6="1" make -f Makefile.cvs && mkdir '/home/odenter/dev/framework/debug' && cd '/home/odenter/dev/framework/debug' && CXXFLAGS="-O0 -g3" "/home/odenter/dev/framework/configure" --enable-debug=full && cd '/home/odenter/dev/framework/debug' && WANT_AUTOCONF_2_5="1" WANT_AUTOMAKE_1_6="1" make -k 
aclocal
autoheader
automake
autoconf
installing -c
checking whether build environment is sane... yes
checking whether make sets $(MAKE)... yes
checking for working aclocal-1.4... found
checking for working autoconf... found
checking for working automake-1.4... found
checking for working autoheader... found
checking for working makeinfo... missing
checking for g++... no
checking for c++... no
checking for gpp... no
checking for aCC... no
checking for CC... no
checking for cxx... no
checking for cc++... no
checking for cl... no
checking for FCC... no
checking for KCC... no
checking for RCC... no
checking for xlC_r... no
checking for xlC... no
checking for C++ compiler default output file name... 
configure: error: C++ compiler cannot create executables
See `config.log' for more details.
*** Exited with status: 77 ***

  • »Sknulp« ist männlich

Beiträge: 715

Registrierungsdatum: 11.03.2006

  • Nachricht senden

15

22.11.2006, 20:29

Schon in config.log (Zeile 29) reingeschaut? Da gibt's weitere Infos.
Software is like sex: it's better when it's free. (Linus Torvalds)

emir

User

  • »emir« ist der Autor dieses Themas

Beiträge: 16

Registrierungsdatum: 20.11.2006

  • Nachricht senden

16

22.11.2006, 20:31

libtool installiert noch immer folgende fehlermeldung:

Quellcode

1
2
3
4
5
cd '/home/emir/a' && WANT_AUTOCONF_2_5="1" WANT_AUTOMAKE_1_6="1" make -f Makefile.cvs && cd '/home/emir/a/debug' && CFLAGS="-O0 -g3 " "/home/emir/a/configure" --enable-debug=full && cd '/home/emir/a/debug' && WANT_AUTOCONF_2_5="1" WANT_AUTOMAKE_1_6="1" make -k 
aclocal
make: aclocal: Kommando nicht gefunden
make: *** [all] Fehler 127
*** Exited with status: 2 ***

  • »Sknulp« ist männlich

Beiträge: 715

Registrierungsdatum: 11.03.2006

  • Nachricht senden

17

22.11.2006, 20:38

@emir: Gib mal aclocal in der Konsole ein. Müßte, wenn keine Parameter übergeben werden folgendes ausspucken: aclocal: `configure.ac' or `configure.in' is required

Nur um zu checken, ob aclocal vorhanden ist. Schließlich meckert er, dass der Befehl aclocal nicht vorhanden wäre.
Software is like sex: it's better when it's free. (Linus Torvalds)

  • »odenter« ist männlich

Beiträge: 21

Registrierungsdatum: 18.11.2006

  • Nachricht senden

18

22.11.2006, 20:49

Also in Zeile 29 ist eine leere Zeile.
Hier ist mal die Datei.

Quellcode

1
2
3
4
5
6
7
8
9
10
11
12
13
14
15
16
17
18
19
20
21
22
23
24
25
26
27
28
29
30
31
32
33
34
35
36
37
38
39
40
41
42
43
44
45
46
47
48
49
50
51
52
53
54
55
56
57
58
59
60
61
62
63
64
65
66
67
68
69
70
71
72
73
74
75
76
77
78
79
80
81
82
83
84
85
86
87
88
89
90
91
92
93
94
95
96
97
98
99
100
101
102
103
104
105
106
107
108
109
110
111
112
113
114
115
116
117
118
119
120
121
122
123
124
125
126
127
128
129
130
131
132
133
134
135
136
137
138
139
140
141
142
143
144
145
146
147
148
149
150
151
152
153
154
155
156
157
158
159
160
161
162
163
164
165
166
167
168
169
170
171
172
173
174
175
176
177
178
179
180
181
182
183
184
185
186
187
188
189
190
191
192
193
194
195
196
197
198
199
200
201
202
203
204
205
206
207
208
209
210
211
212
213
214
215
216
217
218
219
220
221
222
223
224
225
226
227
228
229
230
231
232
233
234
235
236
237
238
239
240
241
242
243
244
245
246
247
248
This file contains any messages produced by compilers while
running configure, to aid debugging if configure makes a mistake.

It was created by configure, which was
generated by GNU Autoconf 2.59.  Invocation command line was

  $ /home/odenter/dev/framework/configure --enable-debug=full

## --------- ##
## Platform. ##
## --------- ##

hostname = mars
uname -m = i686
uname -r = 2.6.15-27-386
uname -s = Linux
uname -v = #1 PREEMPT Sat Sep 16 01:51:59 UTC 2006

/usr/bin/uname -p = unknown
/bin/uname -X     = unknown

/bin/arch              = i686
/usr/bin/arch -k       = unknown
/usr/convex/getsysinfo = unknown
hostinfo               = unknown
/bin/machine           = unknown
/usr/bin/oslevel       = unknown
/bin/universe          = unknown

PATH: /usr/local/sbin
PATH: /usr/local/bin
PATH: /usr/sbin
PATH: /usr/bin
PATH: /sbin
PATH: /bin
PATH: /usr/bin/X11
PATH: /usr/games


## ----------- ##
## Core tests. ##
## ----------- ##

configure:1540: checking for a BSD-compatible install
configure:1595: result: /usr/bin/install -c
configure:1606: checking whether build environment is sane
configure:1649: result: yes
configure:1664: checking whether make sets $(MAKE)
configure:1684: result: yes
configure:1716: checking for working aclocal-1.4
configure:1723: result: found
configure:1731: checking for working autoconf
configure:1738: result: found
configure:1746: checking for working automake-1.4
configure:1753: result: found
configure:1761: checking for working autoheader
configure:1768: result: found
configure:1776: checking for working makeinfo
configure:1787: result: missing
configure:1851: checking for g++
configure:1880: result: no
configure:1851: checking for c++
configure:1880: result: no
configure:1851: checking for gpp
configure:1880: result: no
configure:1851: checking for aCC
configure:1880: result: no
configure:1851: checking for CC
configure:1880: result: no
configure:1851: checking for cxx
configure:1880: result: no
configure:1851: checking for cc++
configure:1880: result: no
configure:1851: checking for cl
configure:1880: result: no
configure:1851: checking for FCC
configure:1880: result: no
configure:1851: checking for KCC
configure:1880: result: no
configure:1851: checking for RCC
configure:1880: result: no
configure:1851: checking for xlC_r
configure:1880: result: no
configure:1851: checking for xlC
configure:1880: result: no
configure:1893: checking for C++ compiler version
configure:1896: g++ --version </dev/null >&5
/home/odenter/dev/framework/configure: line 1897: g++: command not found
configure:1899: $? = 127
configure:1901: g++ -v </dev/null >&5
/home/odenter/dev/framework/configure: line 1902: g++: command not found
configure:1904: $? = 127
configure:1906: g++ -V </dev/null >&5
/home/odenter/dev/framework/configure: line 1907: g++: command not found
configure:1909: $? = 127
configure:1932: checking for C++ compiler default output file name
configure:1935: g++ -O0 -g3   conftest.cc  >&5
/home/odenter/dev/framework/configure: line 1936: g++: command not found
configure:1938: $? = 127
configure: failed program was:
| /* confdefs.h.  */
| 
| #define PACKAGE_NAME ""
| #define PACKAGE_TARNAME ""
| #define PACKAGE_VERSION ""
| #define PACKAGE_STRING ""
| #define PACKAGE_BUGREPORT ""
| #define PACKAGE "framework"
| #define VERSION "0.1"
| /* end confdefs.h.  */
| 
| int
| main ()
| {
| 
|   ;
|   return 0;
| }
configure:1977: error: C++ compiler cannot create executables
See `config.log' for more details.

## ---------------- ##
## Cache variables. ##
## ---------------- ##

ac_cv_env_CC_set=
ac_cv_env_CC_value=
ac_cv_env_CFLAGS_set=
ac_cv_env_CFLAGS_value=
ac_cv_env_CPPFLAGS_set=
ac_cv_env_CPPFLAGS_value=
ac_cv_env_CPP_set=
ac_cv_env_CPP_value=
ac_cv_env_CXXCPP_set=
ac_cv_env_CXXCPP_value=
ac_cv_env_CXXFLAGS_set=set
ac_cv_env_CXXFLAGS_value='-O0 -g3'
ac_cv_env_CXX_set=
ac_cv_env_CXX_value=
ac_cv_env_F77_set=
ac_cv_env_F77_value=
ac_cv_env_FFLAGS_set=
ac_cv_env_FFLAGS_value=
ac_cv_env_LDFLAGS_set=
ac_cv_env_LDFLAGS_value=
ac_cv_env_build_alias_set=
ac_cv_env_build_alias_value=
ac_cv_env_host_alias_set=
ac_cv_env_host_alias_value=
ac_cv_env_target_alias_set=
ac_cv_env_target_alias_value=
ac_cv_path_install='/usr/bin/install -c'
ac_cv_prog_make_make_set=yes

## ----------------- ##
## Output variables. ##
## ----------------- ##

ACLOCAL='aclocal-1.4'
AR=''
AUTOCONF='autoconf'
AUTOHEADER='autoheader'
AUTOMAKE='automake-1.4'
CC=''
CFLAGS=''
CPP=''
CPPFLAGS=''
CXX='g++'
CXXCPP=''
CXXFLAGS='-O0 -g3'
DEFS=''
ECHO='echo'
ECHO_C=''
ECHO_N='-n'
ECHO_T=''
EGREP=''
EXEEXT=''
F77=''
FFLAGS=''
INSTALL_DATA='${INSTALL} -m 644'
INSTALL_PROGRAM='${INSTALL}'
INSTALL_SCRIPT='${INSTALL}'
LDFLAGS=''
LIBOBJS=''
LIBS=''
LIBTOOL=''
LN_S=''
LTLIBOBJS=''
MAKEINFO='/home/odenter/dev/framework/missing makeinfo'
OBJEXT=''
PACKAGE='framework'
PACKAGE_BUGREPORT=''
PACKAGE_NAME=''
PACKAGE_STRING=''
PACKAGE_TARNAME=''
PACKAGE_VERSION=''
PATH_SEPARATOR=':'
RANLIB=''
SET_MAKE=''
SHELL='/bin/sh'
STRIP=''
VERSION='0.1'
ac_ct_AR=''
ac_ct_CC=''
ac_ct_CXX='g++'
ac_ct_F77=''
ac_ct_RANLIB=''
ac_ct_STRIP=''
bindir='${exec_prefix}/bin'
build=''
build_alias=''
build_cpu=''
build_os=''
build_vendor=''
datadir='${prefix}/share'
exec_prefix='NONE'
host=''
host_alias=''
host_cpu=''
host_os=''
host_vendor=''
includedir='${prefix}/include'
infodir='${prefix}/info'
libdir='${exec_prefix}/lib'
libexecdir='${exec_prefix}/libexec'
localstatedir='${prefix}/var'
mandir='${prefix}/man'
oldincludedir='/usr/include'
prefix='NONE'
program_transform_name='s,x,x,'
sbindir='${exec_prefix}/sbin'
sharedstatedir='${prefix}/com'
sysconfdir='${prefix}/etc'
target_alias=''

## ----------- ##
## confdefs.h. ##
## ----------- ##

#define PACKAGE "framework"
#define PACKAGE_BUGREPORT ""
#define PACKAGE_NAME ""
#define PACKAGE_STRING ""
#define PACKAGE_TARNAME ""
#define PACKAGE_VERSION ""
#define VERSION "0.1"

configure: exit 77

  • »Sknulp« ist männlich

Beiträge: 715

Registrierungsdatum: 11.03.2006

  • Nachricht senden

19

23.11.2006, 11:06

Zitat

Also in Zeile 29 ist eine leere Zeile.


Damit war die Zeile 29 in dem Code-Block Deines Posts gemeint. Deinen Source-Code kenne ich doch gar nicht =)

Hier ist schon mal ein Problem (Zeile 60f. im Code-Block Deines Posts ;)):

Zitat

configure:1851: checking for g++
configure:1880: result: no


Denn (Zeile 87ff.):

Zitat

configure:1896: g++ --version </dev/null >&5
/home/odenter/dev/framework/configure: line 1897: g++: command not found
configure:1899: $? = 127
configure:1901: g++ -v </dev/null >&5
/home/odenter/dev/framework/configure: line 1902: g++: command not found
configure:1904: $? = 127
configure:1906: g++ -V </dev/null >&5
/home/odenter/dev/framework/configure: line 1907: g++: command not found
configure:1909: $? = 127
configure:1932: checking for C++ compiler default output file name
configure:1935: g++ -O0 -g3 conftest.cc >&5
/home/odenter/dev/framework/configure: line 1936: g++: command not found
configure:1938: $? = 127
configure: failed program was:


Kein g++ installiert?


Anmerkung: >200 Zeilen Code-Block anzuhängen ist nicht immer gerade schick. Das erzeugt nur übermäßiges scrollen und Mega-Threads.
Sollten die Ausgaben also zu umfangreich werden, hast Du auch die Möglichkeit die Ausgabe in eine Textdatei zu speichern und sie Deinem Post anzuhängen.
Software is like sex: it's better when it's free. (Linus Torvalds)

  • »odenter« ist männlich

Beiträge: 21

Registrierungsdatum: 18.11.2006

  • Nachricht senden

20

23.11.2006, 11:11

Also g++ habe ich sicher nicht installiert. :)
Ich dachte immer der gcc, wäre der eine der alles kann. Werde ich heute abend mal installieren, ich denke das wird es dann aber wohl gewesen sein. :)

Aufjedenfall gibts von mir schonmal ein Danke. :)